Message: previous - next
Month: January 2012

kdebindings 3.5.13 ftbfs

From: Darrell Anderson <humanreadable@...>
Date: Tue, 10 Jan 2012 23:02:00 -0800 (PST)
I seem no longer able to build kdebindings 3.5.13. I have done so several times.

The failure message:

make[4]: Entering directory `/dev/shm/kdebindings/qtjava/javalib'
g++ -DHAVE_CONFIG_H -I. -I../.. -I/opt/trinity/include -I/opt/trinity/lib/qt3-3.3.8.d/include -I. -include tqt.h   -DQT_THREAD_SUPPORT  -D_REENTRANT  -Wno-long-long -Wundef -ansi -D_XOPEN_SOURCE=500 -D_BSD_SOURCE -Wcast-align -Wchar-subscripts -Wall -W -Wpointer-arith -fno-builtin -g3 -fno-inline -O2 -march=i486 -mtune=i686 -Wformat-security -Wmissing-format-attribute -Wno-non-virtual-dtor -fno-exceptions -fno-check-new -fno-common -I/usr/include/tqt  -MT main.o -MD -MP -MF .deps/main.Tpo -c -o main.o main.cpp
mv -f .deps/main.Tpo .deps/main.Po
/bin/sh ../../libtool --tag=CXX   --mode=link g++  -Wno-long-long -Wundef -ansi -D_XOPEN_SOURCE=500 -D_BSD_SOURCE -Wcast-align -Wchar-subscripts -Wall -W -Wpointer-arith -fno-builtin -g3 -fno-inline -O2 -march=i486 -mtune=i686 -Wformat-security -Wmissing-format-attribute -Wno-non-virtual-dtor -fno-exceptions -fno-check-new -fno-common -I/usr/include/tqt  -L/opt/trinity/lib -L/opt/trinity/lib/qt3-3.3.8.d/lib       -o javalib main.o ./qtjava/ -lqt-mt -lXext -lX11
mkdir .libs
g++ -Wno-long-long -Wundef -ansi -D_XOPEN_SOURCE=500 -D_BSD_SOURCE -Wcast-align -Wchar-subscripts -Wall -W -Wpointer-arith -fno-builtin -g3 -fno-inline -O2 -march=i486 -mtune=i686 -Wformat-security -Wmissing-format-attribute -Wno-non-virtual-dtor -fno-exceptions -fno-check-new -fno-common -I/usr/include/tqt -o .libs/javalib main.o  -L/opt/trinity/lib -L/opt/trinity/lib/qt3-3.3.8.d/lib ./qtjava/.libs/ /dev/shm/kdebindings/qtjava/javalib/qtjava/.libs/ /usr/lib/ -lz /usr/lib/ /usr/lib/ /usr/lib/ /usr/lib/ -lpthread /usr/lib/ -lqt-mt /usr/lib/ /usr/lib/ /usr/lib/ -ldl  -Wl,--rpath -Wl,/opt/trinity/lib/jni
./qtjava/.libs/ undefined reference to `QAuServer::tr(char const*, char const*)'
collect2: ld returned 1 exit status
make[4]: *** [javalib] Error 1
make[4]: Leaving directory `/dev/shm/kdebindings/qtjava/javalib'
make[3]: *** [all-recursive] Error 1
make[3]: Leaving directory `/dev/shm/kdebindings/qtjava/javalib'
make[2]: *** [all-recursive] Error 1
make[2]: Leaving directory `/dev/shm/kdebindings/qtjava'
make[1]: *** [all-recursive] Error 1
make[1]: Leaving directory `/dev/shm/kdebindings'
make: *** [all] Error 2

Any help is appreciated.